Target
Female germline-specific tumor suppressor gld-1
Ligand
BDBM51234
Substrate
Meas. Tech.
Fluorescence polarization-based biochemical high throughput dose response assay for inhibitors of GLD-1 protein - TGE RNA interaction
IC50
4963±n/a nM
Citation
 PubChem, PC Fluorescence polarization-based biochemical high throughput dose response assay for inhibitors of GLD-1 protein - TGE RNA interaction PubChem Bioassay (2010)[AID] 
Target
Name:
Female germline-specific tumor suppressor gld-1
Synonyms:
GLD1_CAEEL gld-1
Type:
Enzyme Catalytic Domain
Mol. Mass.:
50591.33
Organism:
Caenorhabditis elegans
Description:
gi_17507875
Residue:
463
  
Inhibitor
Name:
BDBM51234
Synonyms:
MLS001029970 cid_1961333
Type:
Small organic molecule
Emp. Form.:
C22H20N2O2
Mol. Mass.:
344.4064
SMILES:
Cn1c2ccc(N3CCCCC3)c3C(=O)c4ccccc4-c(cc1=O)c23
: