Target
Female germline-specific tumor suppressor gld-1
Ligand
BDBM51287
Substrate
Meas. Tech.
Fluorescence polarization-based biochemical high throughput dose response assay for inhibitors of GLD-1 protein - TGE RNA interaction
IC50
4974±n/a nM
Citation
 PubChem, PC Fluorescence polarization-based biochemical high throughput dose response assay for inhibitors of GLD-1 protein - TGE RNA interaction PubChem Bioassay (2010)[AID] 
Target
Name:
Female germline-specific tumor suppressor gld-1
Synonyms:
GLD1_CAEEL gld-1
Type:
Enzyme Catalytic Domain
Mol. Mass.:
50591.33
Organism:
Caenorhabditis elegans
Description:
gi_17507875
Residue:
463
  
Inhibitor
Name:
BDBM51287
Synonyms:
(3-aminophenazin-2-yl)amine SMR000424784 phenazine-2,3-diamine
Type:
Small organic molecule
Emp. Form.:
C12H10N4
Mol. Mass.:
210.2346
SMILES:
Nc1cc2nc3ccccc3nc2cc1N
: