Target
Female germline-specific tumor suppressor gld-1
Ligand
BDBM67442
Substrate
Meas. Tech.
Fluorescence polarization-based biochemical high throughput dose response assay for inhibitors of GLD-1 protein - TGE RNA interaction
IC50
6133±n/a nM
Citation
 PubChem, PC Fluorescence polarization-based biochemical high throughput dose response assay for inhibitors of GLD-1 protein - TGE RNA interaction PubChem Bioassay (2010)[AID] 
Target
Name:
Female germline-specific tumor suppressor gld-1
Synonyms:
GLD1_CAEEL gld-1
Type:
Enzyme Catalytic Domain
Mol. Mass.:
50591.33
Organism:
Caenorhabditis elegans
Description:
gi_17507875
Residue:
463
  
Inhibitor
Name:
BDBM67442
Synonyms:
3-hydroxy-1-phenalenone 3-hydroxyphenalen-1-one MLS001008607 cid_139030
Type:
Small organic molecule
Emp. Form.:
C13H8O2
Mol. Mass.:
196.2014
SMILES:
O=C1CC(=O)c2cccc3cccc1c23
: