Target
Lysine-specific histone demethylase 1A
Ligand
BDBM270491
Substrate
Meas. Tech.
LSD1 enzymatic assay
pH
7.5±n/a
Temperature
298.15±n/a K
IC50
4.00±n/a nM
Comments
extracted
Citation
 Vaisburg, AMarx, MA LSD1 inhibitors US Patent  US10059668 Publication Date 8/28/2018 
Target
Name:
Lysine-specific histone demethylase 1A
Synonyms:
AOF2 Flavin-containing amine oxidase domain-containing protein 2 KDM1A KIAA0601 Lysine-specific demethylase 1 (LSD1) Lysine-specific histone demethylase 1 (LSD1)
Type:
Enzyme
Mol. Mass.:
92901.01
Organism:
Homo sapiens (Human)
Description:
O60341
Residue:
852
  
Inhibitor
Name:
BDBM270491
Synonyms:
US10059668, Example 55
Type:
Small organic molecule
Emp. Form.:
C25H33N3O3S
Mol. Mass.:
455.613
SMILES:
CN(C(=O)c1ccc(CN2CCC(CN[C@@H]3C[C@H]3c3ccccc3)CC2)cc1)S(C)(=O)=O
: