Target
Short transient receptor potential channel 4
Ligand
BDBM77617
Substrate
Meas. Tech.
SAR Analysis for the identification of selective inhibits of the transient receptor potential cation channel C4 (TRPC4): Automated Electrophysiology
IC50
2630±n/a nM
Citation
 PubChem, PC SAR Analysis for the identification of selective inhibits of the transient receptor potential cation channel C4 (TRPC4): Automated Electrophysiology PubChem Bioassay (2010)[AID] 
Target
Name:
Short transient receptor potential channel 4
Synonyms:
TRPC4_MOUSE Trrp4 | alternatively spliced Trp4
Type:
Enzyme Catalytic Domain
Mol. Mass.:
111587.67
Organism:
Mus musculus
Description:
Q9QUQ5
Residue:
974
  
Inhibitor
Name:
BDBM77617
Synonyms:
4-methyl-2-(1-piperidinyl)quinoline 4-methyl-2-piperidin-1-ylquinoline ML204 cid_230710
Type:
Small organic molecule
Emp. Form.:
C15H18N2
Mol. Mass.:
226.3168
SMILES:
Cc1cc(nc2ccccc12)N1CCCCC1
: