Target
Hexokinase HKDC1 [W721R]
Ligand
BDBM38667
Substrate
Meas. Tech.
Dose Response confirmation of inhibitors of hexokinase domain containing I (HKDC1) in the hexokinase 1 selectivity assay
IC50
80000±n/a nM
Citation
 PubChem, PC Dose Response confirmation of inhibitors of hexokinase domain containing I (HKDC1) in the hexokinase 1 selectivity assay PubChem Bioassay (2011)[AID] 
Target
Name:
Hexokinase HKDC1 [W721R]
Synonyms:
HKDC1 putative hexokinase HKDC1
Type:
Enzyme Catalytic Domain
Mol. Mass.:
102520.24
Organism:
Homo sapiens (Human)
Description:
gi_156151420
Residue:
917
  
Inhibitor
Name:
BDBM38667
Synonyms:
(2R)-2-(1-ketoisoindolin-2-yl)-2-phenyl-acetic acid (2R)-2-(3-oxo-1H-isoindol-2-yl)-2-phenylacetic acid LON-WEI-4d77710c-19 SMR000097535 | cid_5308032
Type:
Small organic molecule
Emp. Form.:
C16H13NO3
Mol. Mass.:
267.2793
SMILES:
OC(=O)[C@H](N1Cc2ccccc2C1=O)c1ccccc1
: