Target
Hexokinase HKDC1 [W721R]
Ligand
BDBM80714
Substrate
Meas. Tech.
Dose Response confirmation of inhibitors of hexokinase domain containing I (HKDC1) in the hexokinase 1 selectivity assay
IC50
7030±n/a nM
Citation
 PubChem, PC Dose Response confirmation of inhibitors of hexokinase domain containing I (HKDC1) in the hexokinase 1 selectivity assay PubChem Bioassay (2011)[AID] 
Target
Name:
Hexokinase HKDC1 [W721R]
Synonyms:
HKDC1 putative hexokinase HKDC1
Type:
Enzyme Catalytic Domain
Mol. Mass.:
102520.24
Organism:
Homo sapiens (Human)
Description:
gi_156151420
Residue:
917
  
Inhibitor
Name:
BDBM80714
Synonyms:
2-(1H-benzimidazol-2-ylmethyl)-1,4-benzenediol 2-(1H-benzimidazol-2-ylmethyl)hydroquinone SMR000298430 | cid_882243
Type:
Small organic molecule
Emp. Form.:
C14H12N2O2
Mol. Mass.:
240.2573
SMILES:
Oc1ccc(O)c(Cc2nc3ccccc3[nH]2)c1
: