Target
Hexokinase HKDC1 [W721R]
Ligand
BDBM80754
Substrate
Meas. Tech.
Dose Response confirmation of inhibitors of hexokinase domain containing I (HKDC1) in the hexokinase 1 selectivity assay
IC50
1830±n/a nM
Citation
 PubChem, PC Dose Response confirmation of inhibitors of hexokinase domain containing I (HKDC1) in the hexokinase 1 selectivity assay PubChem Bioassay (2011)[AID] 
Target
Name:
Hexokinase HKDC1 [W721R]
Synonyms:
HKDC1 putative hexokinase HKDC1
Type:
Enzyme Catalytic Domain
Mol. Mass.:
102520.24
Organism:
Homo sapiens (Human)
Description:
gi_156151420
Residue:
917
  
Inhibitor
Name:
BDBM80754
Synonyms:
1-amino-8-methoxy-benzo[f]quinazoline-7,10-quinone 1-azanyl-8-methoxy-benzo[f]quinazoline-7,10-dione SMR001565374 | cid_3711067
Type:
Small organic molecule
Emp. Form.:
C13H9N3O3
Mol. Mass.:
255.2289
SMILES:
COC1=CC(=O)c2c(ccc3ncnc(N)c23)C1=O
: