Target
Type-2 angiotensin II receptor
Ligand
BDBM50035398
Substrate
Ki
>10000±n/a nM
Comments
PDSP_222
Citation
 Arneric, SPSullivan, JPBriggs, CADonnelly-Roberts, DAnderson, DJRaszkiewicz, JLHughes, MLCadman, EDAdams, PGarvey, DS (S)-3-methyl-5-(1-methyl-2-pyrrolidinyl) isoxazole (ABT 418): a novel cholinergic ligand with cognition-enhancing and anxiolytic activities: I. In vitro characterization. J Pharmacol Exp Ther 270:310-8 (1994) Target
Name:
Type-2 angiotensin II receptor
Synonyms:
AGTR2 AT2 Angiotensin II type 2 (AT-2) receptor Type-2 angiotensin II receptor
Type:
Enzyme Catalytic Domain
Mol. Mass.:
41201.61
Organism:
Homo sapiens (Human)
Description:
Angiotensin II, central 0 0::P50052
Residue:
363
  
Inhibitor
Name:
BDBM50035398
Synonyms:
(S)-1-Methyl-2-(3-methyl-isoxazol-5-yl)-pyrrolidinium 3-Methyl-5-((S)-1-methyl-pyrrolidin-2-yl)-isoxazole CHEMBL274525
Type:
Small organic molecule
Emp. Form.:
C9H14N2O
Mol. Mass.:
166.2203
SMILES:
CN1CCC[C@H]1c1cc(C)no1
: