Target
Toll-like receptor 9
Ligand
BDBM63144
Substrate
Meas. Tech.
Fluorescence-based cell-based high throughput dose response assay for inhibitors of TLR9-MyD88 binding
IC50
3499±n/a nM
Citation
 PubChem, PC Fluorescence-based cell-based high throughput dose response assay for inhibitors of TLR9-MyD88 binding PubChem Bioassay (2011)[AID] 
Target
Name:
Toll-like receptor 9
Synonyms:
CD_antigen: CD289 TLR9_HUMAN
Type:
Enzyme
Mol. Mass.:
115889.91
Organism:
Homo sapiens (Human)
Description:
Q9NR96
Residue:
1032
  
Inhibitor
Name:
BDBM63144
Synonyms:
3-amino-6-phenyl-2-thieno[2,3-b]pyridinecarboxylic acid propan-2-yl ester MLS000581763 cid_2215233 propan-2-yl 3-amino-6-phenylthieno[2,3-b]pyridine-2-carboxylate | propan-2-yl 3-azanyl-6-phenyl-thieno[2,3-b]pyridine-2-carboxylate
Type:
Small organic molecule
Emp. Form.:
C17H16N2O2S
Mol. Mass.:
312.386
SMILES:
CC(C)OC(=O)c1sc2nc(ccc2c1N)-c1ccccc1
: