Target
Angiotensin-converting enzyme
Ligand
BDBM50367254
Substrate
Meas. Tech.
ChEMBL_1671404 (CHEMBL4021433)
IC50
2.5±n/a nM
Citation
 Sattigeri, JASethi, SDavis, JAAhmed, SRayasam, GVJadhav, BGChilla, SMDatta, DGadhave, ATulasi, VKJain, TVoleti, SBenjamin, BUdupa, SJain, GSingh, YSrinivas, KBansal, VSRay, ABhatnagar, PKCliffe, IA Approaches towards the development of chimeric DPP4/ACE inhibitors for treating metabolic syndrome. Bioorg Med Chem Lett 27:2313-2318 (2017)  
Target
Name:
Angiotensin-converting enzyme
Synonyms:
ACE Angiotensin converting enzyme (ACE) Angiotensin-converting enzyme, soluble form CD_antigen=CD143 DCP1 Kininase II
Type:
Enzyme
Mol. Mass.:
149709.01
Organism:
Homo sapiens (Human)
Description:
Residue:
1306
  
Inhibitor
Name:
BDBM50367254
Synonyms:
ENALAPRILAT
Type:
Small organic molecule
Emp. Form.:
C18H24N2O5
Mol. Mass.:
348.3936
SMILES:
C[C@H](N[C@@H](CCc1ccccc1)C(O)=O)C(=O)N1CCC[C@H]1C(O)=O
: