Target
Alpha-1A adrenergic receptor
Ligand
BDBM50090023
Substrate
Meas. Tech.
ChEMBL_1675493 (CHEMBL4025636)
Ki
0.070000±n/a nM
Citation
 Kaur, RChaudhary, SKumar, KGupta, MKRawal, RK Recent synthetic and medicinal perspectives of dihydropyrimidinones: A review. Eur J Med Chem 132:108-134 (2017)  
Target
Name:
Alpha-1A adrenergic receptor
Synonyms:
ADA1A_HUMAN ADRA1C Alpha 1A-adrenoceptor Alpha adrenergic receptor 1a Alpha-adrenergic receptor 1c adrenergic Alpha1 | adrenergic Alpha1C
Type:
Cell-surface receptors
Mol. Mass.:
51511.67
Organism:
Homo sapiens (Human)
Description:
P35348
Residue:
466
  
Inhibitor
Name:
BDBM50090023
Synonyms:
4-(3,4-Difluoro-phenyl)-2-oxo-1,2,3,4-tetrahydro-pyrimidine-5-carboxylic acid {3-[4-(2-cyano-4-fluoro-phenyl)-piperidin-1-yl]-propyl}-amide | CHEMBL94188
Type:
Small organic molecule
Emp. Form.:
C26H26F3N5O2
Mol. Mass.:
497.5121
SMILES:
Fc1ccc(C2CCN(CCCNC(=O)C3C=NC(=O)N[C@@H]3c3ccc(F)c(F)c3)CC2)c(c1)C#N
: