Target
Advanced glycosylation end product-specific receptor
Ligand
BDBM50249581
Substrate
Meas. Tech.
ChEMBL_1680054 (CHEMBL4030331)
Kd
24000000±n/a nM
Citation
 Bongarzone, SSavickas, VLuzi, FGee, AD Targeting the Receptor for Advanced Glycation Endproducts (RAGE): A Medicinal Chemistry Perspective. J Med Chem 60:7213-7232 (2017)  
Target
Name:
Advanced glycosylation end product-specific receptor
Synonyms:
AGER RAGE_HUMAN | Receptor for advanced glycosylation end products
Type:
PROTEIN
Mol. Mass.:
42800.11
Organism:
Homo sapiens (Human)
Description:
ChEMBL_1339877
Residue:
404
  
Inhibitor
Name:
BDBM50249581
Synonyms:
CHEBI:6700 | Matrine
Type:
Small organic molecule
Emp. Form.:
C15H24N2O
Mol. Mass.:
248.3639
SMILES:
[H][C@]12CCCN3CCC[C@]([H])([C@@]4([H])CCCC(=O)N4C1)[C@]23[H]
: