Target
Androgen receptor
Ligand
BDBM50354851
Substrate
Meas. Tech.
ChEBML_1680918
IC50
1880±n/a nM
Citation
 Hemmerling, MNilsson, SEdman, KEirefelt, SRussell, WHendrickx, RJohnsson, EKärrman Mårdh, CBerger, MRehwinkel, HAbrahamsson, ADahmén, JEriksson, ARGabos, BHenriksson, KHossain, NIvanova, SJansson, AHJensen, TJJerre, AJohansson, HKlingstedt, TLepistö, MLindsjö, MMile, INikitidis, GSteele, JTehler, UWissler, LHansson, T Selective Nonsteroidal Glucocorticoid Receptor Modulators for the Inhaled Treatment of Pulmonary Diseases. J Med Chem 60:8591-8605 (2017)  
Target
Name:
Androgen receptor
Synonyms:
ANDR_RAT Ar Nr3c4 | androgen
Type:
Enzyme
Mol. Mass.:
98219.08
Organism:
Rattus norvegicus (Rat)
Description:
P15207
Residue:
902
  
Inhibitor
Name:
BDBM50354851
Synonyms:
FLUTICASONE FUROATE | Veramyst
Type:
Small organic molecule
Emp. Form.:
C27H29F3O6S
Mol. Mass.:
538.576
SMILES:
C[C@@H]1C[C@H]2[C@@H]3C[C@H](F)C4=CC(=O)C=C[C@]4(C)[C@@]3(F)[C@@H](O)C[C@]2(C)[C@@]1(OC(=O)c1ccco1)C(=O)SCF
: