Target
Ubiquitin carboxyl-terminal hydrolase 25
Ligand
BDBM50279687
Substrate
Meas. Tech.
ChEMBL_1721598 (CHEMBL4136598)
IC50
200±n/a nM
Citation
 Kargbo, RB Ubiquitin-Specific Inhibitors for the Treatment of Cancers, Autoimmune, and Infectious Diseases. ACS Med Chem Lett 8:1211-1212 (2017)  
Target
Name:
Ubiquitin carboxyl-terminal hydrolase 25
Synonyms:
3.4.19.12 UBP25_HUMAN USP21 Ubiquitin carboxyl-terminal hydrolase 25 Ubiquitin-specific-processing protease 25
Type:
PROTEIN
Mol. Mass.:
122185.70
Organism:
Homo sapiens
Description:
ChEMBL_118220
Residue:
1055
  
Inhibitor
Name:
BDBM50279687
Synonyms:
CHEMBL4174196
Type:
Small organic molecule
Emp. Form.:
C22H25ClF2N6OS
Mol. Mass.:
494.988
SMILES:
Cl.Cc1cnc2c(N)c(sc2n1)C(=O)NCCc1cc(F)c(cc1F)N1CC2CCC(C1)N2
: