Target
Serine-protein kinase ATM
Ligand
BDBM245514
Substrate
Meas. Tech.
ChEMBL_1738020 (CHEMBL4153770)
IC50
0.250000±n/a nM
Citation
 Pike, KGBarlaam, BCadogan, ECampbell, AChen, YColclough, NDavies, NLde-Almeida, CDegorce, SLDidelot, MDishington, ADucray, RDurant, STHassall, LAHolmes, JHughes, GDMacFaul, PAMulholland, KRMcGuire, TMOuvry, GPass, MRobb, GStratton, NWang, ZWilson, JZhai, BZhao, KAl-Huniti, N The Identification of Potent, Selective, and Orally Available Inhibitors of Ataxia Telangiectasia Mutated (ATM) Kinase: The Discovery of AZD0156 (8-{6-[3-(Dimethylamino)propoxy]pyridin-3-yl}-3-methyl-1-(tetrahydro-2 H-pyran-4-yl)-1,3-dihydro-2 H-imidazo[4,5- c]quinolin-2-one). J Med Chem 61:3823-3841 (2018)  
Target
Name:
Serine-protein kinase ATM
Synonyms:
A-T mutated ATM_HUMAN | Ataxia telangiectasia mutated
Type:
Protein
Mol. Mass.:
350696.72
Organism:
Homo sapiens (Human)
Description:
Q13315
Residue:
3056
  
Inhibitor
Name:
BDBM245514
Synonyms:
US9428503, 42
Type:
Small organic molecule
Emp. Form.:
C25H29N5O3
Mol. Mass.:
447.5295
SMILES:
CNCCCOc1ccc(cn1)-c1ccc2ncc3n(C)c(=O)n([C@@H]4C[C@@H](C4)OC)c3c2c1
: