Target
Beta-secretase 1
Ligand
BDBM312938
Substrate
Meas. Tech.
ChEMBL_1748606 (CHEMBL4183116)
IC50
0.640000±n/a nM
Citation
 O'Neill, BTBeck, EMButler, CRNolan, CEGonzales, CZhang, LDoran, SDLapham, KBuzon, LMDutra, JKBarreiro, GHou, XMartinez-Alsina, LARogers, BNVillalobos, AMurray, JCOgilvie, KLaChapelle, EAChang, CLanyon, LFSteppan, CMRobshaw, AHales, KBoucher, GGPandher, KHoule, CAmbroise, CWKaranian, DRiddell, DBales, KRBrodney, MA Design and Synthesis of Clinical Candidate PF-06751979: A Potent, Brain Penetrant, ?-Site Amyloid Precursor Protein Cleaving Enzyme 1 (BACE1) Inhibitor Lacking Hypopigmentation. J Med Chem 61:4476-4504 (2018)  
Target
Name:
Beta-secretase 1
Synonyms:
ASP2 Aspartyl protease 2 BACE1 Beta-secretase (BACE) Beta-secretase 1 (BACE 1) Beta-secretase 1 (BACE1) Beta-site amyloid precursor protein cleaving enzyme 1 Memapsin-2 beta-Secretase (BACE-1) | beta-Secretase (BACE1)
Type:
Protein
Mol. Mass.:
55755.10
Organism:
Homo sapiens (Human)
Description:
P56817
Residue:
501
  
Inhibitor
Name:
BDBM312938
Synonyms:
N-{2-[(4aR,6S,8aR)-2-amino-6-methyl-4,4a,5,6-tetrahydropyrano[3,4-d][1,3]thiazin-8a(8H)-yl]-1,3-thiazol-4-yl}-1-(difluoromethyl)-1H-pyrazole-3-carboxamide | US9605007, Example 4
Type:
Small Organic Molecule
Emp. Form.:
C16H18F2N6O2S2
Mol. Mass.:
428.48
SMILES:
C[C@H]1C[C@H]2CSC(N)=N[C@]2(CO1)c1nc(NC(=O)c2ccn(n2)C(F)F)cs1
: