Target
Receptor-type tyrosine-protein kinase FLT3
Ligand
BDBM50453195
Substrate
Meas. Tech.
ChEMBL_1749255 (CHEMBL4183765)
IC50
7.0±n/a nM
Citation
 Gucký, T?ezní?ková, ERado?ová Muchová, TJorda, RKlejová, ZMalínková, VBerka, KBazgier, VAjani, HLep?ík, MDivoký, VKry?tof, V Discovery of N J Med Chem 61:3855-3869 (2018)  
Target
Name:
Receptor-type tyrosine-protein kinase FLT3
Synonyms:
CD135 FL cytokine receptor FLK2 FLT3 Fetal liver kinase-2 Fms-like tyrosine kinase 3 (Flt-3) STK-1 Stem cell tyrosine kinase 1
Type:
Enzyme
Mol. Mass.:
112888.62
Organism:
Homo sapiens (Human)
Description:
P36888
Residue:
993
  
Inhibitor
Name:
BDBM50453195
Synonyms:
CHEMBL4202430
Type:
Small organic molecule
Emp. Form.:
C24H34N8O
Mol. Mass.:
450.5798
SMILES:
NCCCCNc1nc(Nc2ccc(cc2)N2CCOCC2)c2ncn(C3CCCC3)c2n1
: