Target
Aurora kinase C
Ligand
BDBM50453821
Substrate
Meas. Tech.
ChEMBL_1750876 (CHEMBL4185636)
IC50
53±n/a nM
Citation
 Ferguson, FMDoctor, ZMChaikuad, ASim, TKim, NDKnapp, SGray, NS Characterization of a highly selective inhibitor of the Aurora kinases. Bioorg Med Chem Lett 27:4405-4408 (2017)  
Target
Name:
Aurora kinase C
Synonyms:
AIE2 AIRK3 AURKC Aurora Kinase C (Aurora-C) Aurora kinase C (AURKC) Aurora-C/INCENP Aurora/Ipl1/Eg2 protein 2 Serine/threonine-protein kinase 13 | Serine/threonine-protein kinase Aurora-C
Type:
Enzyme
Mol. Mass.:
35602.43
Organism:
Homo sapiens (Human)
Description:
Amino acid residues 1-309 were expressed as His-tagged fusion protein using baculovirus expression system.
Residue:
309
  
Inhibitor
Name:
BDBM50453821
Synonyms:
CHEMBL4206831
Type:
Small organic molecule
Emp. Form.:
C30H29N7O3
Mol. Mass.:
535.5964
SMILES:
CCC(=O)Nc1ccc(cc1)C(=O)Nc1ccc(Nc2ncc3N(C)C(=O)c4cc(C)ccc4N(C)c3n2)cc1
: