Target
P2Y purinoceptor 2
Ligand
BDBM50366480
Substrate
Meas. Tech.
ChEMBL_1752099 (CHEMBL4186859)
EC50
200±n/a nM
Citation
 Xu, PFeng, XLuan, HWang, JGe, RLi, ZBian, J Current knowledge on the nucleotide agonists for the P2Y2 receptor. Bioorg Med Chem 26:366-375 (2018)  
Target
Name:
P2Y purinoceptor 2
Synonyms:
ATP receptor P2RY2 P2U purinoceptor 1 P2Y purinoceptor 2 Purinergic receptor | Purinergic receptor P2Y2
Type:
PROTEIN
Mol. Mass.:
42299.21
Organism:
Homo sapiens (Human)
Description:
ChEMBL_1455361
Residue:
377
  
Inhibitor
Name:
BDBM50366480
Synonyms:
ADENOSINE TRIPHOSPHATE | ATP
Type:
Small organic molecule
Emp. Form.:
C10H16N5O13P3
Mol. Mass.:
507.181
SMILES:
Nc1ncnc2n(cnc12)[C@@H]1O[C@H](CO[P@](O)(=O)O[P@@](O)(=O)OP(O)(O)=O)[C@@H](O)[C@H]1O
: