Target
Sodium- and chloride-dependent glycine transporter 1
Ligand
BDBM50457688
Substrate
Meas. Tech.
ChEMBL_1760514 (CHEMBL4195522)
IC50
9.0±n/a nM
Citation
 Santora, VJAlmos, TABarido, RBasinger, JBellows, CLBookser, BCBreitenbucher, JGBroadbent, NJCabebe, CChai, CKChen, MChow, SChung, MCrickard, LDanks, AMFreestone, GCGitnick, DGupta, VHoffmaster, CHudson, ARKaplan, APKennedy, MRLee, DLimberis, JLy, KMak, CCMasatsugu, BMorse, ACNa, JNeul, DNikpur, JPeters, MPetroski, RERenick, JSebring, KSevidal, STabatabaei, AWen, JYan, YYoder, ZWZook, D Design and Synthesis of Novel and Selective Glycine Transporter-1 (GlyT1) Inhibitors with Memory Enhancing Properties. J Med Chem 61:6018-6033 (2018)  
Target
Name:
Sodium- and chloride-dependent glycine transporter 1
Synonyms:
GlyT-1 Glycine transporter 1 Slc6a9 Solute carrier family 6 member 9
Type:
Enzyme Catalytic Domain
Mol. Mass.:
71066.17
Organism:
attus norvegicus (Rat)
Description:
Glycine-1-transporter 0 HUMAN::P28572
Residue:
638
  
Inhibitor
Name:
BDBM50457688
Synonyms:
CHEMBL4206639
Type:
Small organic molecule
Emp. Form.:
C21H18F4N4O4S
Mol. Mass.:
498.451
SMILES:
C[C@H](Oc1ccc(cc1C(=O)N1Cc2cn(nc2C1)-c1cncc(F)c1)S(C)(=O)=O)C(F)(F)F
: