Target
Sodium- and chloride-dependent glycine transporter 1
Ligand
BDBM50457704
Substrate
Meas. Tech.
ChEMBL_1760514 (CHEMBL4195522)
IC50
2.0±n/a nM
Citation
 Santora, VJAlmos, TABarido, RBasinger, JBellows, CLBookser, BCBreitenbucher, JGBroadbent, NJCabebe, CChai, CKChen, MChow, SChung, MCrickard, LDanks, AMFreestone, GCGitnick, DGupta, VHoffmaster, CHudson, ARKaplan, APKennedy, MRLee, DLimberis, JLy, KMak, CCMasatsugu, BMorse, ACNa, JNeul, DNikpur, JPeters, MPetroski, RERenick, JSebring, KSevidal, STabatabaei, AWen, JYan, YYoder, ZWZook, D Design and Synthesis of Novel and Selective Glycine Transporter-1 (GlyT1) Inhibitors with Memory Enhancing Properties. J Med Chem 61:6018-6033 (2018)  
Target
Name:
Sodium- and chloride-dependent glycine transporter 1
Synonyms:
GlyT-1 Glycine transporter 1 Slc6a9 Solute carrier family 6 member 9
Type:
Enzyme Catalytic Domain
Mol. Mass.:
71066.17
Organism:
attus norvegicus (Rat)
Description:
Glycine-1-transporter 0 HUMAN::P28572
Residue:
638
  
Inhibitor
Name:
BDBM50457704
Synonyms:
CHEMBL4202565
Type:
Small organic molecule
Emp. Form.:
C25H21FN4O3S
Mol. Mass.:
476.523
SMILES:
Cc1cc(ccn1)-n1cc2CN(Cc2n1)C(=O)c1cc(ccc1-c1cccc(F)c1)S(C)(=O)=O
: