Target
Probable maltase-glucoamylase 2
Ligand
BDBM50457899
Substrate
Meas. Tech.
ChEMBL_1761008 (CHEMBL4196255)
Ki
3450±n/a nM
Citation
 Zhang, XQMou, XFMao, NHao, JJLiu, MZheng, JYWang, CYGu, YCShao, CL Design, semisynthesis, ?-glucosidase inhibitory, cytotoxic, and antibacterial activities of p-terphenyl derivatives. Eur J Med Chem 146:232-244 (2018)  
Target
Name:
Probable maltase-glucoamylase 2
Synonyms:
3.2.1.3 Glucoamylase MGAM2 Probable maltase-glucoamylase 2
Type:
PROTEIN
Mol. Mass.:
277932.17
Organism:
Homo sapiens
Description:
ChEMBL_116927
Residue:
2515
  
Inhibitor
Name:
BDBM50457899
Synonyms:
CHEMBL4210494
Type:
Small organic molecule
Emp. Form.:
C25H28O5
Mol. Mass.:
408.4868
SMILES:
COc1cc(-c2ccc(O)cc2)c(OC)c(OCCC(C)C)c1-c1ccc(O)cc1
: