Target
Aldehyde dehydrogenase 1A1
Ligand
BDBM50459608
Substrate
Meas. Tech.
ChEMBL_1766744 (CHEMBL4201991)
Ki
285±n/a nM
Citation
 Huddle, BCGrimley, EBuchman, CDChtcherbinine, MDebnath, BMehta, PYang, KMorgan, CALi, SFelton, JSun, DMehta, GNeamati, NBuckanovich, RJHurley, TDLarsen, SD Structure-Based Optimization of a Novel Class of Aldehyde Dehydrogenase 1A (ALDH1A) Subfamily-Selective Inhibitors as Potential Adjuncts to Ovarian Cancer Chemotherapy. J Med Chem 61:8754-8773 (2018)  
Target
Name:
Aldehyde dehydrogenase 1A1
Synonyms:
AL1A1_HUMAN ALDH-E1 ALDH1A1 Aldehyde dehydrogenase 1A1 (ALDH1A1) Aldehyde dehydrogenase family 1 member A1 (ALDH1A1) PUMB1 RalDH1 | Retinal dehydrogenase 1
Type:
Protein
Mol. Mass.:
54862.21
Organism:
Homo sapiens (Human)
Description:
Residue:
501
  
Inhibitor
Name:
BDBM50459608
Synonyms:
CHEBI:90441 | CHEMBL3276621
Type:
Small organic molecule
Emp. Form.:
C12H20Cl4N2O2
Mol. Mass.:
366.111
SMILES:
ClC(Cl)C(=O)NCCCCCCCCNC(=O)C(Cl)Cl
: