Target
Casein kinase II subunit alpha
Ligand
BDBM50460939
Substrate
Meas. Tech.
ChEMBL_1770559 (CHEMBL4222671)
IC50
5.0±n/a nM
Citation
 Gingipalli, LBlock, MHBao, LCooke, EDakin, LADenz, CRFerguson, ADJohannes, JWLarsen, NALyne, PDPontz, TWWang, TWu, XWu, AZhang, HJZheng, XDowling, JELamb, ML Discovery of 2,6-disubstituted pyrazine derivatives as inhibitors of CK2 and PIM kinases. Bioorg Med Chem Lett 28:1336-1341 (2018)  
Target
Name:
Casein kinase II subunit alpha
Synonyms:
CK II CK2- alpha CSK21_HUMAN Casein kinase 2 Casein kinase II alpha/beta Casein kinase II subunit alpha (CK2A1) Casein kinase II subunit alpha (CK2a V66A) Casein kinase II subunit alpha (CK2a)
Type:
Enzyme
Mol. Mass.:
45151.12
Organism:
Homo sapiens (Human)
Description:
P68400
Residue:
391
  
Inhibitor
Name:
BDBM50460939
Synonyms:
CHEMBL4228654
Type:
Small organic molecule
Emp. Form.:
C21H19N5O2
Mol. Mass.:
373.4079
SMILES:
CC(C)Nc1ccc2cnn(-c3cncc(n3)-c3ccc(cc3)C(O)=O)c2c1
: