Target
Angiotensin-converting enzyme
Ligand
BDBM50073120
Substrate
Meas. Tech.
ChEMBL_1797788 (CHEMBL4269905)
IC50
2.0±n/a nM
Citation
 Cozier, GEArendse, LBSchwager, SLSturrock, EDAcharya, KR Molecular Basis for Multiple Omapatrilat Binding Sites within the ACE C-Domain: Implications for Drug Design. J Med Chem 61:10141-10154 (2018)  
Target
Name:
Angiotensin-converting enzyme
Synonyms:
ACE Angiotensin converting enzyme (ACE) Angiotensin-converting enzyme, soluble form CD_antigen=CD143 DCP1 Kininase II
Type:
Enzyme
Mol. Mass.:
149709.01
Organism:
Homo sapiens (Human)
Description:
Residue:
1306
  
Inhibitor
Name:
BDBM50073120
Synonyms:
(4S,6S,9aS)-6-((S)-2-Mercapto-3-phenyl-propionylamino)-5-oxo-octahydro-9-thia-4a-aza-benzocycloheptene-4-carboxylic acid BMS-186716 OMAPATRILAT
Type:
Small organic molecule
Emp. Form.:
C19H24N2O4S2
Mol. Mass.:
408.535
SMILES:
OC(=O)[C@@H]1CCC[C@@H]2SCC[C@H](NC(=O)[C@@H](S)Cc3ccccc3)C(=O)N12
: