Target
Thymidine kinase
Ligand
BDBM50001103
Substrate
Meas. Tech.
ChEMBL_80692 (CHEMBL690787)
EC50
31100±n/a nM
Citation
 Holý, AGünter, JDvoráková, HMasojídková, MAndrei, GSnoeck, RBalzarini, JDe Clercq, E Structure-antiviral activity relationship in the series of pyrimidine and purine N-[2-(2-phosphonomethoxy)ethyl] nucleotide analogues. 1. Derivatives substituted at the carbon atoms of the base. J Med Chem 42:2064-86 (1999)  
Target
Name:
Thymidine kinase
Synonyms:
2.7.1.21 HHV3_gp38 ORF36 Thymidine kinase
Type:
PROTEIN
Mol. Mass.:
37846.07
Organism:
Human herpesvirus 3
Description:
ChEMBL_14068
Residue:
341
  
Inhibitor
Name:
BDBM50001103
Synonyms:
(2-(6-amino-9H-purin-9-yl)ethoxy)methylphosphonic acid 9-(2-(phosphonomethoxy)ethyl)adenine 9-[2-(phosphonomethoxy)ethyl]adenine 9-[3-(Phosphonomethoxy)ethyl]adenine (PMEA) CHEMBL484 US10071110, Compound Adefovir [2-(6-Amino-purin-9-yl)-ethoxymethyl]-phosphonic acid(PMEA) {[2-(6-AMINO-9H-PURIN-9-YL)ETHOXY]METHYL}PHOSPHONIC ACID
Type:
Small organic molecule
Emp. Form.:
C8H12N5O4P
Mol. Mass.:
273.1857
SMILES:
Nc1ncnc2n(CCOCP(O)(O)=O)cnc12
: