Target
Adenosine receptor A1
Ligand
BDBM50079652
Substrate
Meas. Tech.
ChEMBL_27467 (CHEMBL642477)
Ki
0.489779±n/a nM
Citation
 Akahane, AKatayama, HMitsunaga, TKato, TKinoshita, TKita, YKusunoki, TTerai, TYoshida, KShiokawa, Y Discovery of 6-oxo-3-(2-phenylpyrazolo[1,5-a]pyridin-3-yl)-1(6H)- pyridazinebutanoic acid (FK 838): a novel non-xanthine adenosine A1 receptor antagonist with potent diuretic activity. J Med Chem 42:779-83 (1999)  
Target
Name:
Adenosine receptor A1
Synonyms:
AA1R_RAT ADENOSINE A1 high Adenosine A1 receptor (A1) Adenosine receptors A1 | Adora1
Type:
Protein
Mol. Mass.:
36704.13
Organism:
Rattus norvegicus (rat)
Description:
Residue:
326
  
Inhibitor
Name:
BDBM50079652
Synonyms:
(E)-1-[(R)-2-(2-Hydroxy-ethyl)-piperidin-1-yl]-3-(2-phenyl-pyrazolo[1,5-a]pyridin-3-yl)-propenone 1-[2-(2-Hydroxy-ethyl)-piperidin-1-yl]-3-(2-phenyl-pyrazolo[1,5-a]pyridin-3-yl)-propenone FK-453
Type:
Small organic molecule
Emp. Form.:
C23H25N3O2
Mol. Mass.:
375.4635
SMILES:
OCC[C@H]1CCCCN1C(=O)\C=C\c1c(nn2ccccc12)-c1ccccc1
: