Target
Neuronal acetylcholine receptor subunit alpha-4/beta-2
Ligand
BDBM50171347
Substrate
Meas. Tech.
ChEMBL_303683 (CHEMBL830443)
Ki
0.050000±n/a nM
Citation
 Bisson, WHScapozza, LWestera, GMu, LSchubiger, PA Ligand selectivity for the acetylcholine binding site of the rat alpha4beta2 and alpha3beta4 nicotinic subtypes investigated by molecular docking. J Med Chem 48:5123-30 (2005)  
Target
Name:
Neuronal acetylcholine receptor subunit alpha-4/beta-2
Synonyms:
Neuronal acetylcholine receptor alpha4/beta2 Neuronal acetylcholine receptor; alpha4/beta2
Type:
Mol. Mass.:
Description:
Components:
This complex has 0 components.
Component 1
Name:
Neuronal acetylcholine receptor subunit alpha-4
Synonyms:
ACHA4_RAT Cholinergic, Nicotinic Alpha4Beta2 Chrna4 Neuronal acetylcholine receptor (alpha4beta2 nAChR) Neuronal acetylcholine receptor subunit alpha 4 beta 2 | Neuronal acetylcholine receptor subunit alpha-4
Type:
Enzyme
Mol. Mass.:
70196.44
Organism:
Rattus norvegicus (Rat)
Description:
P09483
Residue:
630
  
Component 2
Name:
Neuronal acetylcholine receptor subunit beta-2
Synonyms:
ACHB2_RAT Chrnb2 Neuronal acetylcholine receptor non-alpha-1 chain
Type:
Enzyme
Mol. Mass.:
56910.32
Organism:
Rattus norvegicus (Rat)
Description:
P12390
Residue:
500
  
Inhibitor
Name:
BDBM50171347
Synonyms:
3-(Azetidin-2-ylmethoxy)-pyridine CHEMBL190589
Type:
Small organic molecule
Emp. Form.:
C9H12N2O
Mol. Mass.:
164.2044
SMILES:
C(Oc1cccnc1)C1CCN1
: