Target
1,3-beta-glucan synthase
Ligand
BDBM50417554
Substrate
Meas. Tech.
ChEMBL_731127 (CHEMBL1697533)
IC50
3510±n/a nM
Citation
 Garcia-Effron, GLee, SPark, SCleary, JDPerlin, DS Effect of Candida glabrata FKS1 and FKS2 mutations on echinocandin sensitivity and kinetics of 1,3-beta-D-glucan synthase: implication for the existing susceptibility breakpoint. Antimicrob Agents Chemother 53:3690-9 (2009)  
Target
Name:
1,3-beta-glucan synthase
Synonyms:
1,3-beta-glucan synthase component GSC2 FKS2
Type:
PROTEIN
Mol. Mass.:
217615.31
Organism:
Candida glabrata
Description:
ChEMBL_18077
Residue:
1897
  
Inhibitor
Name:
BDBM50417554
Synonyms:
ANIDULAFUNGIN
Type:
Small organic molecule
Emp. Form.:
C58H73N7O17
Mol. Mass.:
1140.2369
SMILES:
CCCCCOc1ccc(cc1)-c1ccc(cc1)-c1ccc(cc1)C(=O)N[C@H]1C[C@@H](O)[C@@H](O)NC(=O)[C@@H]2[C@@H](O)[C@@H](C)CN2C(=O)[C@@H](NC(=O)[C@@H](NC(=O)[C@@H]2C[C@@H](O)CN2C(=O)[C@@H](NC1=O)[C@@H](C)O)[C@H](O)[C@@H](O)c1ccc(O)cc1)[C@@H](C)O
: