Target
UDP-3-O-acyl-N-acetylglucosamine deacetylase
Ligand
BDBM50483411
Substrate
Meas. Tech.
ChEMBL_809999 (CHEMBL2015108)
IC50
0.600000±n/a nM
Citation
 Warmus, JSQuinn, CLTaylor, CMurphy, STJohnson, TALimberakis, COrtwine, DBronstein, JPagano, PKnafels, JDLightle, SMochalkin, IBrideau, RPodoll, T Structure based design of an in vivo active hydroxamic acid inhibitor of P. aeruginosa LpxC. Bioorg Med Chem Lett 22:2536-43 (2012)  
Target
Name:
UDP-3-O-acyl-N-acetylglucosamine deacetylase
Synonyms:
LPXC_ECOLI UDP-3-O-[3-hydroxymyristoyl] N-acetylglucosamine deacetylase (LxpC) asmB lpxC
Type:
Enzyme
Mol. Mass.:
33952.00
Organism:
Escherichia coli
Description:
P0A725
Residue:
305
  
Inhibitor
Name:
BDBM50483411
Synonyms:
CHEMBL1668464
Type:
Small organic molecule
Emp. Form.:
C23H27N5O3
Mol. Mass.:
421.4922
SMILES:
C[C@@H](N)[C@@H](NC(=O)N1CCN(CC1)c1ccc(cc1)C#Cc1ccccc1)C(=O)NO
: