Target
Solute carrier family 22 member 6
Ligand
BDBM50485603
Substrate
Meas. Tech.
ChEMBL_836288 (CHEMBL2076301)
Ki
1900±n/a nM
Citation
 Pombrio, JMGiangreco, ALi, LWempe, MFAnders, MWSweet, DHPritchard, JBBallatori, N Mercapturic acids (N-acetylcysteine S-conjugates) as endogenous substrates for the renal organic anion transporter-1. Mol Pharmacol 60:1091-9 (2001)  
Target
Name:
Solute carrier family 22 member 6
Synonyms:
Oat1 S22A6_RAT rOAT1 renal organic anion transporter 1
Type:
PROTEIN
Mol. Mass.:
60784.17
Organism:
Rattus norvegicus
Description:
ChEMBL_838479
Residue:
551
  
Inhibitor
Name:
BDBM50485603
Synonyms:
CHEBI:7426 | CHEMBL2074738
Type:
Small organic molecule
Emp. Form.:
C11H11N3O7S
Mol. Mass.:
329.286
SMILES:
CC(=O)N[C@@H](CSc1ccc(cc1[N+]([O-])=O)[N+]([O-])=O)C(O)=O
: