Target
Potassium-transporting ATPase alpha chain 1/subunit beta
Ligand
BDBM50032002
Substrate
Meas. Tech.
ChEMBL_76067 (CHEMBL688289)
pH
7±n/a
IC50
180±n/a nM
Comments
extracted
Citation
 Leach, CABrown, THIfe, RJKeeling, DJParsons, METheobald, CJWiggall, KJ Reversible inhibitors of the gastric (H+/K+)-ATPase. 4. Identification of an inhibitor with an intermediate duration of action. J Med Chem 38:2748-62 (1995)  
Target
Name:
Potassium-transporting ATPase alpha chain 1/subunit beta
Synonyms:
Potassium-transporting ATPase | Potassium-transporting ATPase alpha chain 1/beta chain
Type:
Mol. Mass.:
Description:
Components:
This complex has 0 components.
Component 1
Name:
Potassium-transporting ATPase subunit beta
Synonyms:
ATP4B Gastric H(+)/K(+) ATPase subunit beta Potassium-transporting ATPase beta chain Proton pump beta chain | gp60-90
Type:
Mol. Mass.:
33083.09
Organism:
Sus scrofa (Pig)
Description:
Residue:
290
  
Component 2
Name:
Potassium-transporting ATPase alpha chain 1
Synonyms:
ATP4A Gastric H(+)/K(+) ATPase subunit alpha Na/K-ATPase Potassium-transporting ATPase alpha chain 1 | Proton pump
Type:
Enzyme
Mol. Mass.:
114279.23
Organism:
Sus scrofa (Pig)
Description:
P19156
Residue:
1034
  
Inhibitor
Name:
BDBM50032002
Synonyms:
1-[8-Hydroxymethyl-4-(4-hydroxy-2-methyl-phenylamino)-quinolin-3-yl]-butan-1-one | CHEMBL316116
Type:
Small organic molecule
Emp. Form.:
C21H22N2O3
Mol. Mass.:
350.411
SMILES:
CCCC(=O)c1cnc2c(CO)cccc2c1Nc1ccc(O)cc1C
: