Target
Adenylate cyclase type 5
Ligand
BDBM50010686
Substrate
Meas. Tech.
ChEMBL_31713 (CHEMBL645373)
EC50
141±n/a nM
Citation
 Knoerzer, TAWatts, VJNichols, DEMailman, RB Synthesis and biological evaluation of a series of substituted benzo[a]phenanthridines as agonists at D1 and D2 dopamine receptors. J Med Chem 38:3062-70 (1995)  
Target
Name:
Adenylate cyclase type 5
Synonyms:
ADCY5_RAT Adcy5 Adenylate cyclase type IX Adenylyl cyclase 5
Type:
PROTEIN
Mol. Mass.:
139188.88
Organism:
Rattus norvegicus
Description:
ChEMBL_31725
Residue:
1262
  
Inhibitor
Name:
BDBM50010686
Synonyms:
(6aR,12bS)-10,11-Dihydroxy-5,6,6a,7,8,12b-hexahydro-benzo[a]phenanthridinium 10,11-Dihydroxy-5,6,6a,7,8,12b-hexahydro-benzo[a]phenanthridinium(DHX) CHEMBL25856 | dihydrexidine
Type:
Small organic molecule
Emp. Form.:
C17H17NO2
Mol. Mass.:
267.3224
SMILES:
Oc1cc2CC[C@H]3NCc4ccccc4[C@@H]3c2cc1O
: