Target
Retinoic acid receptor RXR-alpha
Ligand
BDBM50032667
Substrate
Meas. Tech.
ChEMBL_196906 (CHEMBL807368)
EC50
210±n/a nM
Citation
 Dawson, MIJong, LHobbs, PDCameron, JFChao, WRPfahl, MLee, MOShroot, BPfahl, M Conformational effects on retinoid receptor selectivity. 2. Effects of retinoid bridging group on retinoid X receptor activity and selectivity. J Med Chem 38:3368-83 (1995)  
Target
Name:
Retinoic acid receptor RXR-alpha
Synonyms:
NR2B1 Nuclear receptor subfamily 4 group A member 2 RXRA Retinoic acid receptor RXR-alpha/gamma Retinoid receptor
Type:
PROTEIN
Mol. Mass.:
50820.38
Organism:
Homo sapiens (Human)
Description:
ChEMBL_1456363
Residue:
462
  
Inhibitor
Name:
BDBM50032667
Synonyms:
4-(3,5,5,8,8-Pentamethyl-5,6,7,8-tetrahydro-naphthalene-2-carbonyl)-benzoic acid CHEMBL98172
Type:
Small organic molecule
Emp. Form.:
C23H26O3
Mol. Mass.:
350.4507
SMILES:
Cc1cc2c(cc1C(=O)c1ccc(cc1)C(O)=O)C(C)(C)CCC2(C)C
: