Target
Adenosine receptor A1
Ligand
BDBM50039688
Substrate
Meas. Tech.
ChEMBL_29600 (CHEMBL640258)
Kd
0.74±n/a nM
Citation
 Scammells, PJBaker, SPBelardinelli, LOlsson, RA Substituted 1,3-dipropylxanthines as irreversible antagonists of A1 adenosine receptors. J Med Chem 37:2704-12 (1994)  
Target
Name:
Adenosine receptor A1
Synonyms:
A1 adenosine receptor (hA1) AA1R_HUMAN ADORA1 Adenosine A1-receptor Adenosine receptor A1 (hA1) | Adenosine transporter (AdT)
Type:
G Protein-Coupled Receptor (GPCR)
Mol. Mass.:
36520.92
Organism:
Homo sapiens (Human)
Description:
P30542
Residue:
326
  
Inhibitor
Name:
BDBM50039688
Synonyms:
4-[2-(2,6-Dioxo-1,3-dipropyl-2,3,6,7-tetrahydro-1H-purin-8-yl)-ethylcarbamoyl]-benzenesulfonyl fluoride | CHEMBL329810
Type:
Small organic molecule
Emp. Form.:
C20H24FN5O5S
Mol. Mass.:
465.498
SMILES:
CCCn1c2nc(CCNC(=O)c3ccc(cc3)S(F)(=O)=O)[nH]c2c(=O)n(CCC)c1=O
: