Target
Lysine-specific demethylase 4C
Ligand
BDBM50240772
Substrate
Meas. Tech.
ChEMBL_1287257 (CHEMBL3110468)
IC50
>100000±n/a nM
Citation
 Rotili, DTomassi, SConte, MBenedetti, RTortorici, MCiossani, GValente, SMarrocco, BLabella, DNovellino, EMattevi, AAltucci, LTumber, AYapp, CKing, ONHopkinson, RJKawamura, ASchofield, CJMai, A Pan-histone demethylase inhibitors simultaneously targeting Jumonji C and lysine-specific demethylases display high anticancer activities. J Med Chem 57:42-55 (2014)  
Target
Name:
Lysine-specific demethylase 4C
Synonyms:
GASC-1 protein Gene amplified in squamous cell carcinoma 1 protein JMJD2C Jumonji domain-containing protein 2C KDM4C_HUMAN | KIAA0780
Type:
Protein
Mol. Mass.:
119979.01
Organism:
Homo sapiens (Human)
Description:
Q9H3R0
Residue:
1056
  
Inhibitor
Name:
BDBM50240772
Synonyms:
(1R,2S)-(-)-2-phenylcyclopropylamine (tranylcypromine)2-Phenyl-cyclopropylamine CHEMBL1179 TRANYLCYPROMINE US10836743, Compound TCP US9180183, Tranylcypromine rel-Tranylcypromine
Type:
Small organic molecule
Emp. Form.:
C9H11N
Mol. Mass.:
133.1903
SMILES:
N[C@@H]1C[C@H]1c1ccccc1
: