Target
Aldo-keto reductase family 1 member B10
Ligand
BDBM23420
Substrate
Meas. Tech.
ChEMBL_1540742 (CHEMBL3745356)
IC50
32200±n/a nM
Citation
 Zemanova, LHofman, JNovotna, EMusilek, KLundova, THavrankova, JHostalkova, AChlebek, JCahlikova, LWsol, V Flavones Inhibit the Activity of AKR1B10, a Promising Therapeutic Target for Cancer Treatment. J Nat Prod 78:2666-74 (2015)  
Target
Name:
Aldo-keto reductase family 1 member B10
Synonyms:
AK1BA_HUMAN AKR1B11 ARP Aldo-keto reductase family 1 member B10 (AKR1B10) Aldose reductase-like SI reductase hARP
Type:
Protein
Mol. Mass.:
36024.67
Organism:
Homo sapiens (Human)
Description:
O60218. 1ZUA; 4JII; 4GQ0
Residue:
316
  
Inhibitor
Name:
BDBM23420
Synonyms:
7,4′-Dihydroxy-isoflavone (3a) CHEMBL8145 US8552057, 7
Type:
isoflavone
Emp. Form.:
C15H10O4
Mol. Mass.:
254.2375
SMILES:
Oc1ccc(cc1)-c1coc2cc(O)ccc2c1=O
: