Target
Protein-S-isoprenylcysteine O-methyltransferase
Ligand
BDBM50502486
Substrate
Meas. Tech.
ChEMBL_1807706 (CHEMBL4307065)
IC50
0.200000±n/a nM
Citation
 Kargbo, RB Treatment of Cancers by Inhibition of Isoprenylcysteine Carboxyl Methyltransferase. ACS Med Chem Lett 10:1024-1025 (2019)  
Target
Name:
Protein-S-isoprenylcysteine O-methyltransferase
Synonyms:
ICMT Isoprenylcysteine carboxyl methyltransferase | PCCMT
Type:
PROTEIN
Mol. Mass.:
31943.26
Organism:
Homo sapiens (Human)
Description:
ChEMBL_956034
Residue:
284
  
Inhibitor
Name:
BDBM50502486
Synonyms:
CHEMBL4468997 | US11834430, Compound 5
Type:
Small organic molecule
Emp. Form.:
C19H16ClN3O2
Mol. Mass.:
353.802
SMILES:
Cc1nccn1-c1cccc(OCCOc2ccc(cc2Cl)C#N)c1
: