Target
Polyunsaturated fatty acid lipoxygenase ALOX12
Ligand
BDBM50009004
Substrate
Meas. Tech.
ChEMBL_203 (CHEMBL615237)
IC50
100±n/a nM
Citation
 Bhatia, PABrooks, CDBasha, ARatajczyk, JDGunn, BPBouska, JBLanni, CYoung, PRBell, RLCarter, GW 5-Lipoxygenase inhibitors: synthesis and structure-activity relationships of a series of 1-aryl-2H,4H-tetrahydro-1,2,4-triazin-3-ones. J Med Chem 39:3938-50 (1996)  
Target
Name:
Polyunsaturated fatty acid lipoxygenase ALOX12
Synonyms:
12-LOX 12LO Arachidonate 12-lipoxygenase LOG12 Platelet 12-lipoxygenase | Platelet-type lipoxygenase 12
Type:
Protein
Mol. Mass.:
75689.18
Organism:
Homo sapiens (Human)
Description:
P18054
Residue:
663
  
Inhibitor
Name:
BDBM50009004
Synonyms:
(phenidone)1-Phenyl-pyrazolidin-3-one 1-Phenyl-pyrazolidin-3-one (Phenidone) 1-phenylpyrazolidin-3-one PHENIDONE
Type:
Small organic molecule
Emp. Form.:
C9H10N2O
Mol. Mass.:
162.1885
SMILES:
O=C1CCN(N1)c1ccccc1
: