Target
Alpha-2B adrenergic receptor
Ligand
BDBM50052880
Substrate
Meas. Tech.
ChEMBL_33498 (CHEMBL646997)
Ki
17±n/a nM
Citation
 Munk, SAHarcourt, DAArasasingham, PNBurke, JAKharlamb, ABManlapaz, CAPadillo, EURoberts, DRunde, EWilliams, LWheeler, LAGarst, ME Synthesis and evaluation of 2-(arylamino)imidazoles as alpha 2-adrenergic agonists. J Med Chem 40:18-23 (1997)  
Target
Name:
Alpha-2B adrenergic receptor
Synonyms:
ADA2B_RAT Adrenergic receptor alpha Alpha-2B adrenergic receptor Alpha-2B adrenoreceptor | adrenergic Alpha2B
Type:
Enzyme Catalytic Domain
Mol. Mass.:
50379.83
Organism:
NEONATAL RAT
Description:
adrenergic Alpha2B ADRA2B NEONATAL RAT::P19328
Residue:
453
  
Inhibitor
Name:
BDBM50052880
Synonyms:
CHEMBL49137 | Imidazolidin-2-ylidene-(5-methyl-quinoxalin-6-yl)-amine
Type:
Small organic molecule
Emp. Form.:
C12H13N5
Mol. Mass.:
227.2651
SMILES:
[#6]-c1c(ccc2nccnc12)\[#7]=[#6]-1\[#7]-[#6]-[#6]-[#7]-1
: