Target
Alpha-2A adrenergic receptor
Ligand
BDBM50055837
Substrate
Meas. Tech.
ChEMBL_33066 (CHEMBL647965)
Ki
39±n/a nM
Citation
 Munk, SAHarcourt, DAArasasingham, PNBurke, JAKharlamb, ABManlapaz, CAPadillo, EURoberts, DRunde, EWilliams, LWheeler, LAGarst, ME Synthesis and evaluation of 2-(arylamino)imidazoles as alpha 2-adrenergic agonists. J Med Chem 40:18-23 (1997)  
Target
Name:
Alpha-2A adrenergic receptor
Synonyms:
ADA2A_HUMAN ADRA2R Adrenergic alpha2A Alpha-2 adrenergic receptor subtype C10 Alpha-2A adrenoreceptor alpha-2A adrenergic receptor [Homo sapiens]
Type:
Enzyme
Mol. Mass.:
48979.91
Organism:
Homo sapiens (Human)
Description:
P08913
Residue:
450
  
Inhibitor
Name:
BDBM50055837
Synonyms:
(5-tert-Butyl-4-methoxy-2-methyl-phenyl)-(1H-imidazol-2-yl)-amine | CHEMBL78190
Type:
Small organic molecule
Emp. Form.:
C15H21N3O
Mol. Mass.:
259.3467
SMILES:
COc1cc(C)c(Nc2ncc[nH]2)cc1C(C)(C)C
: