Target
Insulin-like growth factor 1 receptor
Ligand
BDBM50065271
Substrate
Meas. Tech.
ChEMBL_90281 (CHEMBL697346)
IC50
10100±n/a nM
Citation
 Sun, LTran, NTang, FApp, HHirth, PMcMahon, GTang, C Synthesis and biological evaluations of 3-substituted indolin-2-ones: a novel class of tyrosine kinase inhibitors that exhibit selectivity toward particular receptor tyrosine kinases. J Med Chem 41:2588-603 (1998)  
Target
Name:
Insulin-like growth factor 1 receptor
Synonyms:
CD_antigen=CD221 IGF1R Insulin-like growth factor 1 receptor (IGF1R) Insulin-like growth factor 1 receptor alpha chain Insulin-like growth factor I receptor | Insulin-like growth factor receptor (IGFR)
Type:
Protein
Mol. Mass.:
154776.79
Organism:
Homo sapiens (Human)
Description:
P08069
Residue:
1367
  
Inhibitor
Name:
BDBM50065271
Synonyms:
3-(4-hydroxy-3,5-diisopropylbenzylidene)indolin-2-one CHEMBL85021 | ST-280
Type:
Small organic molecule
Emp. Form.:
C21H23NO2
Mol. Mass.:
321.4128
SMILES:
CC(C)c1cc(\C=C2/C(=O)Nc3ccccc23)cc(C(C)C)c1O
: