Target
cGMP-inhibited 3',5'-cyclic phosphodiesterase 3A
Ligand
BDBM14754
Substrate
Meas. Tech.
ChEMBL_1854467 (CHEMBL4355196)
IC50
287±n/a nM
Citation
 Huang, YYYu, YFZhang, CChen, YZhou, QLi, ZZhou, SLi, ZGuo, LWu, DWu, YLuo, HB Validation of Phosphodiesterase-10 as a Novel Target for Pulmonary Arterial Hypertension via Highly Selective and Subnanomolar Inhibitors. J Med Chem 62:3707-3721 (2019)  
Target
Name:
cGMP-inhibited 3',5'-cyclic phosphodiesterase 3A
Synonyms:
3',5'-cyclic phosphodiesterase Cyclic GMP-inhibited phosphodiesterase A PDE3A_HUMAN Phosphodiesterase 3 (PDE3) Phosphodiesterase 3A Phosphodiesterase 3A (PDE3A1) cGMP-inhibited 3',5'-cyclic phosphodiesterase A | cGMP-inhibited 3,5-cyclic phosphodiesterase A
Type:
Enzyme
Mol. Mass.:
124966.46
Organism:
Homo sapiens (Human)
Description:
Q14432
Residue:
1141
  
Inhibitor
Name:
BDBM14754
Synonyms:
1-[(3,4-dimethoxyphenyl)methyl]-6,7-dimethoxy-isoquinoline 6,7-dimethoxy-1-veratryl-isoquinoline;hydrochloride Papaverine
Type:
Small organic molecule
Emp. Form.:
C20H21NO4
Mol. Mass.:
339.385
SMILES:
COc1ccc(Cc2nccc3cc(OC)c(OC)cc23)cc1OC
: