Target
Acetyl-coenzyme A synthetase, cytoplasmic
Ligand
BDBM50517061
Substrate
Meas. Tech.
ChEMBL_1867284 (CHEMBL4368259)
IC50
0.002800±n/a nM
Citation
 Kargbo, RB Inhibition of ACSS2 for Treatment of Cancer and Neuropsychiatric Diseases. ACS Med Chem Lett 10:1100-1101 (2019)  
Target
Name:
Acetyl-coenzyme A synthetase, cytoplasmic
Synonyms:
6.2.1.1 ACAS2 ACSA_HUMAN AceCS Acetate--CoA ligase Acetyl-CoA synthetase 1 Acyl-CoA synthetase short-chain family member 2 Propionate--CoA ligase
Type:
PROTEIN
Mol. Mass.:
78577.73
Organism:
Homo sapiens
Description:
ChEMBL_119217
Residue:
701
  
Inhibitor
Name:
BDBM50517061
Synonyms:
CHEMBL4467131
Type:
Small organic molecule
Emp. Form.:
C25H20F4N4O3
Mol. Mass.:
500.4449
SMILES:
CC1=NN(C(=O)C1C(=O)Nc1cccc(c1)C(C)(F)F)c1ccc(OC(F)F)c(c1)-c1ccncc1
: