Target
Leukotriene C4 synthase
Ligand
BDBM50519570
Substrate
Meas. Tech.
ChEMBL_1876789 (CHEMBL4378183)
IC50
0.360000±n/a nM
Target
Name:
Leukotriene C4 synthase
Synonyms:
LTC4 synthase LTC4S_HUMAN | Leukotriene-C(4) synthase
Type:
PROTEIN
Mol. Mass.:
16575.59
Organism:
Homo sapiens (Human)
Description:
ChEMBL_961179
Residue:
150
  
Inhibitor
Name:
BDBM50519570
Synonyms:
CHEMBL4567083
Type:
Small organic molecule
Emp. Form.:
C21H21F4N3O4
Mol. Mass.:
455.4028
SMILES:
COc1nc(cnc1C(=O)[C@H]1C[C@@H]1C(O)=O)N(CC(C)C)c1cc(ccc1F)C(F)(F)F
: