Target
5-hydroxytryptamine receptor 1D
Ligand
BDBM50060425
Substrate
Meas. Tech.
ChEMBL_1678 (CHEMBL616668)
EC50
0.8±n/a nM
Citation
 Sternfeld, FGuiblin, ARJelley, RAMatassa, VGReeve, AJHunt, PABeer, MSHeald, AStanton, JASohal, BWatt, APStreet, LJ Synthesis and serotonergic activity of 3-[2-(pyrrolidin-1-yl)ethyl]indoles: potent agonists for the h5-HT1D receptor with high selectivity over the h5-HT1B receptor. J Med Chem 42:677-90 (1999)  
Target
Name:
5-hydroxytryptamine receptor 1D
Synonyms:
5-HT-1D 5-HT1D 5HT1D_HUMAN HTR1DA Serotonin (5-HT) receptor | Serotonin Receptor 1D
Type:
G Protein-Coupled Receptor (GPCR)
Mol. Mass.:
41920.63
Organism:
Homo sapiens (Human)
Description:
Receptor binding assays were performed using human clone stably expressed in CHO cells.
Residue:
377
  
Inhibitor
Name:
BDBM50060425
Synonyms:
Benzyl-{(S)-1-[2-(5-[1,2,4]triazol-4-yl-1H-indol-3-yl)-ethyl]-pyrrolidin-3-ylmethyl}-amine L-760790
Type:
Small organic molecule
Emp. Form.:
C24H28N6
Mol. Mass.:
400.5193
SMILES:
C(Cc1c[nH]c2ccc(cc12)-n1cnnc1)N1CC[C@@H](CNCc2ccccc2)C1
: