Target
5-hydroxytryptamine receptor 1D
Ligand
BDBM50074180
Substrate
Meas. Tech.
ChEMBL_1680 (CHEMBL617040)
EC50
0.8±n/a nM
Citation
 Chambers, MSStreet, LJGoodacre, SHobbs, SCHunt, PJelley, RAMatassa, VGReeve, AJSternfeld, FBeer, MSStanton, JARathbone, DWatt, APMacLeod, AM 3-(Piperazinylpropyl)indoles: selective, orally bioavailable h5-HT1D receptor agonists as potential antimigraine agents. J Med Chem 42:691-705 (1999)  
Target
Name:
5-hydroxytryptamine receptor 1D
Synonyms:
5-HT-1D 5-HT1D 5HT1D_HUMAN HTR1DA Serotonin (5-HT) receptor | Serotonin Receptor 1D
Type:
G Protein-Coupled Receptor (GPCR)
Mol. Mass.:
41920.63
Organism:
Homo sapiens (Human)
Description:
Receptor binding assays were performed using human clone stably expressed in CHO cells.
Residue:
377
  
Inhibitor
Name:
BDBM50074180
Synonyms:
CHEMBL164035 | N,N-Dimethyl-2-phenyl-2-{4-[3-(5-[1,2,4]triazol-4-yl-1H-indol-3-yl)-propyl]-piperazin-1-yl}-acetamide
Type:
Small organic molecule
Emp. Form.:
C27H33N7O
Mol. Mass.:
471.5972
SMILES:
CN(C)C(=O)C(N1CCN(CCCc2c[nH]c3ccc(cc23)-n2cnnc2)CC1)c1ccccc1
: