Target
Isoleucine--tRNA ligase
Ligand
BDBM50075068
Substrate
Meas. Tech.
ChEBML_88808
IC50
8000±n/a nM
Citation
 Yu, XYHill, JMYu, GWang, WKluge, AFWendler, PGallant, P Synthesis and structure-activity relationships of a series of novel thiazoles as inhibitors of aminoacyl-tRNA synthetases. Bioorg Med Chem Lett 9:375-80 (1999)  
Target
Name:
Isoleucine--tRNA ligase
Synonyms:
IleRS Isoleucyl-tRNA synthetase ileS
Type:
PROTEIN
Mol. Mass.:
104861.59
Organism:
Staphylococcus aureus
Description:
ChEMBL_88808
Residue:
917
  
Inhibitor
Name:
BDBM50075068
Synonyms:
((2S,3S)-2-Amino-3-methyl-pentanoyl)-sulfamic acid (2R,3S,4R,5R)-3,4-dihydroxy-5-(4-phenyl-thiazol-2-yl)-tetrahydro-furan-2-ylmethyl ester | CHEMBL264002
Type:
Small organic molecule
Emp. Form.:
C20H27N3O7S2
Mol. Mass.:
485.574
SMILES:
CC[C@H](C)[C@H](N)C(=O)NS(=O)(=O)OC[C@H]1O[C@H]([C@H](O)[C@@H]1O)c1nc(cs1)-c1ccccc1
: