Target
5-hydroxytryptamine receptor 1D
Ligand
BDBM50065417
Substrate
Meas. Tech.
ChEMBL_1683 (CHEMBL617043)
EC50
0.4±n/a nM
Citation
 van Niel, MBCollins, IBeer, MSBroughton, HBCheng, SKGoodacre, SCHeald, ALocker, KLMacLeod, AMMorrison, DMoyes, CRO'Connor, DPike, ARowley, MRussell, MGSohal, BStanton, JAThomas, SVerrier, HWatt, APCastro, JL Fluorination of 3-(3-(piperidin-1-yl)propyl)indoles and 3-(3-(piperazin-1-yl)propyl)indoles gives selective human 5-HT1D receptor ligands with improved pharmacokinetic profiles. J Med Chem 42:2087-104 (1999)  
Target
Name:
5-hydroxytryptamine receptor 1D
Synonyms:
5-HT-1D 5-HT1D 5HT1D_HUMAN HTR1DA Serotonin (5-HT) receptor | Serotonin Receptor 1D
Type:
G Protein-Coupled Receptor (GPCR)
Mol. Mass.:
41920.63
Organism:
Homo sapiens (Human)
Description:
Receptor binding assays were performed using human clone stably expressed in CHO cells.
Residue:
377
  
Inhibitor
Name:
BDBM50065417
Synonyms:
3-[3-(4-Benzyl-4-fluoro-piperidin-1-yl)-propyl]-5-[1,2,4]triazol-4-yl-1H-indole | CHEMBL294732
Type:
Small organic molecule
Emp. Form.:
C25H28FN5
Mol. Mass.:
417.5217
SMILES:
FC1(Cc2ccccc2)CCN(CCCc2c[nH]c3ccc(cc23)-n2cnnc2)CC1
: